{"text_format":"1","workbook":"xlsx","n_sheets":7,"sheets":["Users Guide","2024 Farm Bill Calculator","Background Calculations","MYA Prices","ARC-CO Calculations","SCO Coverage","County List"],"not_rendered":{"charts":0,"images":4,"macros":1,"external_links":0,"defined_names":5,"comments":1,"pivot_tables":0},"unopened":[],"bounds":{"document_bytes":16777216,"sheet_cells":100000,"rows_first":2000,"rows_last":500,"rows_between":2000,"halvings":0,"cell_chars":16384,"cell_head_chars":4096},"cells_cut":0,"cells_raw":0,"read":"whole","date_system":"1900"}

{"sheet":"Users Guide","index":0,"n_rows":66,"n_cols":3,"rows_kept":66,"cut":false,"hidden":false,"merged":[]}
[]
[]
[]
[]
[]
[null,null,"MSU 2024 Farm Bill Analyzer USERS GUIDE"]
[null,null,"Version 3.0"]
[null,null,"Michigan State University Extension"]
[null,null,"Based on design created by Roger Betz"]
[]
[null,null,"The MSU FARM BILL ANALYZER provides an analysis of the one important decision that are included in the Agricultural Act of 2018 (the 2018 Farm Bill).  Owners and/or tenants can elect either the Agricultural Risk Coverage (ARC-CO or ARC-IC) or Price Loss Coverage (PLC) programs for each covered commodity on each of their farms."]
[]
[null,null,"This FARM BILL ANALYZER provides farm management information on the ARC Co versus PLC decisions based on assumptions about county yields and national market prices.  Given the inputted variables listed below, the MSU FARM BILL ANALYZER will calculate the consequences for the farm manager’s alternative decisions the election of ARC-CO or PLC programs. The ARC Individual (ARC-IC) program is not analyzed by the tool but is available in the Farm Bill."]
[]
[null,null,"Disclaimer: This MSU FARM BILL ANALYZER is designed with the most recent information available about the provisions of the current Farm Bill."]
[]
[null,null,"I.     To operate the MSU FARM BILL ANALYZER, the user will need the following information:"]
[null,null,"A.    The Farm Service Agency (FSA) PLC program yields by FSA farm number."]
[null,null,"B.    If the farm has irrigated yields, the irrigated and non-irrigated yields by acres by year need to be separated."]
[null,null,"C.    Assumed county average yields (irrigated and non-irrigated) for the county in which the farm is located."]
{"$rows_left_out":47}
{"sheet":"2024 Farm Bill Calculator","index":1,"n_rows":57,"n_cols":10,"rows_kept":57,"cut":false,"hidden":false,"merged":[[30,4,30,8],[43,0,44,0],[33,4,33,6],[35,4,35,5],[35,6,35,7],[35,8,35,9],[34,4,34,9],[42,1,42,3],[43,1,43,3],[0,2,0,8],[1,2,1,8],[29,8,29,9],[51,2,51,3],[40,4,40,8],[48,1,48,3],[44,2,44,3],[41,1,41,3],[26,4,26,5],[26,6,26,7],[26,8,26,9],[45,1,45,3],[47,4,47,8],[49,1,49,3],[50,1,50,3],[28,8,28,9],[55,1,55,3],[56,1,56,3],[3,5,3,6],[4,5,4,6],[54,1,54,3],[27,4,27,5],[19,4,19,8],[27,6,27,7],[27,8,27,9],[29,4,29,5],[29,6,29,7],[21,4,21,9],[25,4,25,9],[17,4,17,9],[28,4,28,5],[28,6,28,7]]}
[null,null,"MSU 2024 FARM BILL ANALYZER"]
[null,null,"Version 3.0"]
["Step 1. Select Farm's County"]
[null,"County Farm located:","Shiawassee","< Select County","Farm Name:","Smith"]
[null,null,null,null,"Farm Number:",1234]
[]
["Step 2. Enter Acres, Yields and Irrigation Percentage (from FSA CCC-861,156) for each farm"]
[null,"Commodity","Corn","Soybeans","Wheat"]
[null,"Base Acres",0,0,0,{"$f":"SUM(C9:E9)","v":0},"Total Base Acres"]
[null," PLC Yield",0,0,0]
[null,"Historical Irrigated Percentage",0,0,0]
[null,"Actual Planted Acres",0,0,0,{"$f":"SUM(C12:E12)","v":0},"Total Planted Acres"]
[]
[null,null,null,null,"CORN",null,"SOYBEANS",null,"WHEAT"]
[null,null,null,"National Loan Rates",2.2000000000000002,null,6.2,null,3.38]
[null,null,null,"Effective Reference Prices",{"$f":"'Background Calculations'!R41","v":4.006333333333334},null,{"$f":"'Background Calculations'!R42","v":9.2565000000000026},null,{"$f":"'Background Calculations'!R43","v":5.5}]
[null,null,null,"Benchmark Prices",{"$f":"'Background Calculations'!L54","v":4.8499999999999996},null,{"$f":"'Background Calculations'!L55","v":11.12},null,{"$f":"'Background Calculations'!L56","v":6.21}]
[null,null,null,null,"Benchmark Years 2018 - 2022"]
["Step 3. Enter Anticipated COUNTY Yields"]
[null,null,null,{"$f":"C4","v":"Shiawassee"},"County Weighted Yield (Irrigated and Dry)"]
{"$rows_left_out":38}
{"sheet":"Background Calculations","index":2,"n_rows":56,"n_cols":18,"rows_kept":56,"cut":false,"hidden":true,"merged":[[12,2,12,3],[22,1,28,1]]}
[null,null,{"$f":"'2024 Farm Bill Calculator'!C4","v":"Shiawassee"}]
[null,null,null,"County Trend Yield from FSA ARC-CO",2017,2018,2019,2020,2021,2022,2023,2024]
[null,"all","Corn",{"$f":"'2024 Farm Bill Calculator'!$C$4&C3&B3","v":"ShiawasseeCornall"},{"$f":"IFERROR(VLOOKUP($D3,'ARC-CO Calculations'!$B$5:$Q$289,9,0),0)","v":165.59},{"$f":"IFERROR(VLOOKUP($D3,'ARC-CO Calculations'!$B$5:$Q$289,10,0),0)","v":160.91999999999999},{"$f":"IFERROR(VLOOKUP($D3,'ARC-CO Calculations'!$B$5:$Q$289,11,0),0)","v":159.34},{"$f":"IFERROR(VLOOKUP($D3,'ARC-CO Calculations'!$B$5:$Q$289,12,0),0)","v":176.13},{"$f":"IFERROR(VLOOKUP($D3,'ARC-CO Calculations'!$B$5:$Q$289,13,0),0)","v":176.62},{"$f":"IFERROR(VLOOKUP($D3,'ARC-CO Calculations'!$B$5:$Q$289,14,0),0)","v":160.25},{"$f":"IFERROR(VLOOKUP($D3,'ARC-CO Calculations'!$B$5:$Q$289,15,0),0)","v":168.55199999999999},{"$f":"IFERROR(VLOOKUP($D3,'ARC-CO Calculations'!$B$5:$Q$289,16,0),0)","v":170.07840000000002}]
[null,"all","soybeans",{"$f":"'2024 Farm Bill Calculator'!$C$4&C4&B4","v":"Shiawasseesoybeansall"},{"$f":"IFERROR(VLOOKUP($D4,'ARC-CO Calculations'!$B$5:$Q$289,9,0),0)","v":0},{"$f":"IFERROR(VLOOKUP($D4,'ARC-CO Calculations'!$B$5:$Q$289,10,0),0)","v":0},{"$f":"IFERROR(VLOOKUP($D4,'ARC-CO Calculations'!$B$5:$Q$289,11,0),0)","v":0},{"$f":"IFERROR(VLOOKUP($D4,'ARC-CO Calculations'!$B$5:$Q$289,12,0),0)","v":0},{"$f":"IFERROR(VLOOKUP($D4,'ARC-CO Calculations'!$B$5:$Q$289,13,0),0)","v":0},{"$f":"IFERROR(VLOOKUP($D4,'ARC-CO Calculations'!$B$5:$Q$289,14,0),0)","v":0},{"$f":"IFERROR(VLOOKUP($D4,'ARC-CO Calculations'!$B$5:$Q$289,15,0),0)","v":0},{"$f":"IFERROR(VLOOKUP($D4,'ARC-CO Calculations'!$B$5:$Q$289,16,0),0)","v":0}]
[null,"all","Wheat",{"$f":"'2024 Farm Bill Calculator'!$C$4&C5&B5","v":"ShiawasseeWheatall"},{"$f":"IFERROR(VLOOKUP($D5,'ARC-CO Calculations'!$B$5:$Q$289,9,0),0)","v":71.31},{"$f":"IFERROR(VLOOKUP($D5,'ARC-CO Calculations'!$B$5:$Q$289,10,0),0)","v":91.87},{"$f":"IFERROR(VLOOKUP($D5,'ARC-CO Calculations'!$B$5:$Q$289,11,0),0)","v":64.569999999999993},{"$f":"IFERROR(VLOOKUP($D5,'ARC-CO Calculations'!$B$5:$Q$289,12,0),0)","v":74.56},{"$f":"IFERROR(VLOOKUP($D5,'ARC-CO Calculations'!$B$5:$Q$289,13,0),0)","v":80.319999999999993},{"$f":"IFERROR(VLOOKUP($D5,'ARC-CO Calculations'!$B$5:$Q$289,14,0),0)","v":76.34},{"$f":"IFERROR(VLOOKUP($D5,'ARC-CO Calculations'!$B$5:$Q$289,15,0),0)","v":77.531999999999996},{"$f":"IFERROR(VLOOKUP($D5,'ARC-CO Calculations'!$B$5:$Q$289,16,0),0)","v":74.664399999999986}]
[null,"Irrigated","Corn",{"$f":"'2024 Farm Bill Calculator'!$C$4&C6&B6","v":"ShiawasseeCornIrrigated"},{"$f":"IFERROR(VLOOKUP($D6,'ARC-CO Calculations'!$B$5:$Q$289,9,0),0)","v":0},{"$f":"IFERROR(VLOOKUP($D6,'ARC-CO Calculations'!$B$5:$Q$289,10,0),0)","v":0},{"$f":"IFERROR(VLOOKUP($D6,'ARC-CO Calculations'!$B$5:$Q$289,11,0),0)","v":0},{"$f":"IFERROR(VLOOKUP($D6,'ARC-CO Calculations'!$B$5:$Q$289,12,0),0)","v":0},{"$f":"IFERROR(VLOOKUP($D6,'ARC-CO Calculations'!$B$5:$Q$289,13,0),0)","v":0},{"$f":"IFERROR(VLOOKUP($D6,'ARC-CO Calculations'!$B$5:$Q$289,14,0),0)","v":0},{"$f":"IFERROR(VLOOKUP($D6,'ARC-CO Calculations'!$B$5:$Q$289,15,0),0)","v":0},{"$f":"IFERROR(VLOOKUP($D6,'ARC-CO Calculations'!$B$5:$Q$289,16,0),0)","v":0}]
[null,"Irrigated","soybeans",{"$f":"'2024 Farm Bill Calculator'!$C$4&C7&B7","v":"ShiawasseesoybeansIrrigated"},{"$f":"IFERROR(VLOOKUP($D7,'ARC-CO Calculations'!$B$5:$Q$289,9,0),0)","v":40.340000000000003},{"$f":"IFERROR(VLOOKUP($D7,'ARC-CO Calculations'!$B$5:$Q$289,10,0),0)","v":52.230000000000004},{"$f":"IFERROR(VLOOKUP($D7,'ARC-CO Calculations'!$B$5:$Q$289,11,0),0)","v":42.66},{"$f":"IFERROR(VLOOKUP($D7,'ARC-CO Calculations'!$B$5:$Q$289,12,0),0)","v":49.79},{"$f":"IFERROR(VLOOKUP($D7,'ARC-CO Calculations'!$B$5:$Q$289,13,0),0)","v":59.53},{"$f":"IFERROR(VLOOKUP($D7,'ARC-CO Calculations'!$B$5:$Q$289,14,0),0)","v":53.48},{"$f":"IFERROR(VLOOKUP($D7,'ARC-CO Calculations'!$B$5:$Q$289,15,0),0)","v":51.977999999999994},{"$f":"IFERROR(VLOOKUP($D7,'ARC-CO Calculations'!$B$5:$Q$289,16,0),0)","v":51.927599999999998}]
[null,"nonirrigated","Corn",{"$f":"'2024 Farm Bill Calculator'!$C$4&C8&B8","v":"ShiawasseeCornnonirrigated"},{"$f":"IFERROR(VLOOKUP($D8,'ARC-CO Calculations'!$B$5:$Q$289,9,0),0)","v":0},{"$f":"IFERROR(VLOOKUP($D8,'ARC-CO Calculations'!$B$5:$Q$289,10,0),0)","v":0},{"$f":"IFERROR(VLOOKUP($D8,'ARC-CO Calculations'!$B$5:$Q$289,11,0),0)","v":0},{"$f":"IFERROR(VLOOKUP($D8,'ARC-CO Calculations'!$B$5:$Q$289,12,0),0)","v":0},{"$f":"IFERROR(VLOOKUP($D8,'ARC-CO Calculations'!$B$5:$Q$289,13,0),0)","v":0},{"$f":"IFERROR(VLOOKUP($D8,'ARC-CO Calculations'!$B$5:$Q$289,14,0),0)","v":0},{"$f":"IFERROR(VLOOKUP($D8,'ARC-CO Calculations'!$B$5:$Q$289,15,0),0)","v":0},{"$f":"IFERROR(VLOOKUP($D8,'ARC-CO Calculations'!$B$5:$Q$289,16,0),0)","v":0}]
[null,"nonirrigated","soybeans",{"$f":"'2024 Farm Bill Calculator'!$C$4&C9&B9","v":"Shiawasseesoybeansnonirrigated"},{"$f":"IFERROR(VLOOKUP($D9,'ARC-CO Calculations'!$B$5:$Q$289,9,0),0)","v":42.480000000000004},{"$f":"IFERROR(VLOOKUP($D9,'ARC-CO Calculations'!$B$5:$Q$289,10,0),0)","v":49.86},{"$f":"IFERROR(VLOOKUP($D9,'ARC-CO Calculations'!$B$5:$Q$289,11,0),0)","v":36.659999999999997},{"$f":"IFERROR(VLOOKUP($D9,'ARC-CO Calculations'!$B$5:$Q$289,12,0),0)","v":52.97},{"$f":"IFERROR(VLOOKUP($D9,'ARC-CO Calculations'!$B$5:$Q$289,13,0),0)","v":53.21},{"$f":"IFERROR(VLOOKUP($D9,'ARC-CO Calculations'!$B$5:$Q$289,14,0),0)","v":42.56},{"$f":"IFERROR(VLOOKUP($D9,'ARC-CO Calculations'!$B$5:$Q$289,15,0),0)","v":47.492000000000004},{"$f":"IFERROR(VLOOKUP($D9,'ARC-CO Calculations'!$B$5:$Q$289,16,0),0)","v":47.0184}]
[null,"Irrigated","Wheat",{"$f":"'2024 Farm Bill Calculator'!$C$4&C10&B10","v":"ShiawasseeWheatIrrigated"},{"$f":"IFERROR(VLOOKUP($D10,'ARC-CO Calculations'!$B$5:$Q$289,9,0),0)","v":0},{"$f":"IFERROR(VLOOKUP($D10,'ARC-CO Calculations'!$B$5:$Q$289,10,0),0)","v":0},{"$f":"IFERROR(VLOOKUP($D10,'ARC-CO Calculations'!$B$5:$Q$289,11,0),0)","v":0},{"$f":"IFERROR(VLOOKUP($D10,'ARC-CO Calculations'!$B$5:$Q$289,12,0),0)","v":0},{"$f":"IFERROR(VLOOKUP($D10,'ARC-CO Calculations'!$B$5:$Q$289,13,0),0)","v":0},{"$f":"IFERROR(VLOOKUP($D10,'ARC-CO Calculations'!$B$5:$Q$289,14,0),0)","v":0},{"$f":"IFERROR(VLOOKUP($D10,'ARC-CO Calculations'!$B$5:$Q$289,15,0),0)","v":0},{"$f":"IFERROR(VLOOKUP($D10,'ARC-CO Calculations'!$B$5:$Q$289,16,0),0)","v":0}]
[null,"nonirrigated","Wheat",{"$f":"'2024 Farm Bill Calculator'!$C$4&C11&B11","v":"ShiawasseeWheatnonirrigated"},{"$f":"IFERROR(VLOOKUP($D11,'ARC-CO Calculations'!$B$5:$Q$289,9,0),0)","v":0},{"$f":"IFERROR(VLOOKUP($D11,'ARC-CO Calculations'!$B$5:$Q$289,10,0),0)","v":0},{"$f":"IFERROR(VLOOKUP($D11,'ARC-CO Calculations'!$B$5:$Q$289,11,0),0)","v":0},{"$f":"IFERROR(VLOOKUP($D11,'ARC-CO Calculations'!$B$5:$Q$289,12,0),0)","v":0},{"$f":"IFERROR(VLOOKUP($D11,'ARC-CO Calculations'!$B$5:$Q$289,13,0),0)","v":0},{"$f":"IFERROR(VLOOKUP($D11,'ARC-CO Calculations'!$B$5:$Q$289,14,0),0)","v":0},{"$f":"IFERROR(VLOOKUP($D11,'ARC-CO Calculations'!$B$5:$Q$289,15,0),0)","v":0},{"$f":"IFERROR(VLOOKUP($D11,'ARC-CO Calculations'!$B$5:$Q$289,16,0),0)","v":0}]
[]
[null,null,"County Olympic Average Yield ARC-CO",null,2017,2018,2019,2020,2021,2022,2023,2024]
[null,null,"Corn",{"$f":"D3","v":"ShiawasseeCornall"},null,null,{"$f":"(SUM(E3:E3)-MAX(E3:E3)-MIN(E3:E3))/3","v":-55.196666666666665},{"$f":"(SUM(E3:F3)-MAX(E3:F3)-MIN(E3:F3))/3","v":0},{"$f":"(SUM(E3:G3)-MAX(E3:G3)-MIN(E3:G3))/3","v":53.639999999999993},{"$f":"(SUM(E3:H3)-MAX(E3:H3)-MIN(E3:H3))/3","v":108.83666666666666},{"$f":"(SUM(E3:I3)-MAX(E3:I3)-MIN(E3:I3))/3","v":167.54666666666665},{"$f":"(SUM(F3:J3)-MAX(F3:J3)-MIN(F3:J3))/3","v":165.76666666666665}]
[null,null,"soybeans","Shiawasseesoybeansall",null,null,{"$f":"((SUM(E4:E4)-MAX(E4:E4)-MIN(E4:E4)))/3","v":0},{"$f":"(SUM(E4:F4)-MAX(E4:F4)-MIN(E4:F4))/3","v":0},0,0,0,{"$f":"(SUM(F4:J4)-MAX(F4:J4)-MIN(F4:J4))/3","v":0}]
[null,null,"Wheat","ShiawasseeWheatall",null,null,{"$f":"(SUM(E5:E5)-MAX(E5:E5)-MIN(E5:E5))/3","v":-23.77},0,23.77,48.623333333333335,75.396666666666661,77.073333333333323]
[null,null,"Corn","ShiawasseeCornIrrigated",null,null,{"$f":"(SUM(E6:E6)-MAX(E6:E6)-MIN(E6:E6))/3","v":0},0,0,{"$f":"(SUM(E6:H6)-MAX(E6:H6)-MIN(E6:H6))/3","v":0},{"$f":"(SUM(E6:I6)-MAX(E6:I6)-MIN(E6:I6))/3","v":0},0]
[null,null,"soybeans","ShiawasseesoybeansIrrigated",null,null,{"$f":"(SUM(E7:E7)-MAX(E7:E7)-MIN(E7:E7))/3","v":-13.446666666666667},0,14.220000000000004,30.816666666666674,48.226666666666667,51.833333333333336]
[null,null,"Corn",{"$f":"D8","v":"ShiawasseeCornnonirrigated"},null,null,{"$f":"(SUM(E8:E8)-MAX(E8:E8)-MIN(E8:E8))/3","v":0},0,0,0,0,0]
[null,null,"soybeans",{"$f":"D9","v":"Shiawasseesoybeansnonirrigated"},null,null,{"$f":"(SUM(E9:E9)-MAX(E9:E9)-MIN(E9:E9))/3","v":-14.160000000000002},0,14.160000000000002,30.78,48.436666666666667,{"$f":"(SUM(F9:J9)-MAX(F9:J9)-MIN(F9:J9))/3","v":48.463333333333338}]
{"$rows_left_out":37}
{"sheet":"MYA Prices","index":3,"n_rows":30,"n_cols":20,"rows_kept":30,"cut":false,"hidden":true,"merged":[]}
[1,2,3,4,5,6,7,8,9,10,11,12,13,14,15,16,17,18,19,20]
[null,1,2,3,4]
[null,null,"Corn 24/25","SOY 24/25","Wheat 24/25"]
[null,"CBO Baseline",4.5,11.25,6.3]
[null,"FAPRI",4.47,10.94,6.33]
[null,"Futures '24 Harvest (as of 2/13/2024)",4.6900000000000004,11.67,6.07]
[null,"Kansas State (2024/2025)",5.0599999999999996,12.33,7.43]
[null,"USDA/ERS MYA Proj (2023/2024)",4.71,12.42,7.08]
[null,"USDA/ERS Ag Baseline Projections",4.5,11.3,6.8]
[null,"USDA/WASDE (2023/2024)",4.8,12.65,7.2]
[null,"ARC-CO Benchmark Price",{"$f":"'Background Calculations'!L54","v":4.8499999999999996},{"$f":"'Background Calculations'!L55","v":11.12},{"$f":"'Background Calculations'!L56","v":6.21}]
[null,"Effective Reference Prices",{"$f":"'2024 Farm Bill Calculator'!E16","v":4.006333333333334},{"$f":"'2024 Farm Bill Calculator'!G16","v":9.2565000000000026},{"$f":"'2024 Farm Bill Calculator'!I16","v":5.5}]
[null,"Statutory Reference Prices",3.7,8.4,5.5]
[null,"Average ",{"$f":"AVERAGEIF(C4:C10,\"<>0\")","v":4.6757142857142853},{"$f":"AVERAGEIF(D4:D10,\"<>0\")","v":11.794285714285715},{"$f":"AVERAGEIF(E4:E10,\"<>0\")","v":6.7442857142857147}]
[]
[]
[null,null,null,"Updated  10/30/23"]
[null,null,null,null,null,null,null,null,null,null,null,null,null,null,"UPDATES "]
[null,null,null,"FAPRI - Food and Agricultural Policy Research Institute  (http://www.fapri.missouri.edu/)",null,null,null,null,"http://www.fapri.missouri.edu/"]
[null,null,null,"USDA's Agricultural Projections to 2028",null,null,null,null,null,null,null,null,null,null,null,null," "]
{"$rows_left_out":11}
{"sheet":"ARC-CO Calculations","index":4,"n_rows":289,"n_cols":29,"rows_kept":289,"cut":false,"hidden":true,"merged":[]}
[null,null,"ARC-CO TREND ADJUSTED YIELDS, BENCHMARK YIELDS AND GUARANTEE REVENUES FOR PROGRAM YEAR 2024",null,null,null,null,null,null,null,null,null,null,null,null,null,null,null,null,"PROJECTED Program Year 2024 Benchmark Yields and Revenues"]
[null,null,null,null,null,null,null,null,null,null,null,null,null,null,null,null,null,null,null,"A","B","C","D","E","F","G","H","I","J"]
[null,{"$f":"'2024 Farm Bill Calculator'!C4","v":"Shiawassee"},null,null,null,null,null,null,null,null,null,null,null,null,null,null,null,null,null,null,null,"(A * B)","(86% of C)","(10% of C)",null,null,"(F * G)","(D - H), not less than 0","Lesser of E or I (capped at 10% of Benchmark)"]
[null,null,"ST_Cty","State Name","County Name","Sub County","Crop Name","Unit","ARC-CO Yield Designation","2017 trend adjusted (county yield or 80% of T)","2018 trend adjusted (county yield or 80% of T)","2019 trend adjusted (county yield or 80% of T)","2020 trend adjusted (county yield or 80% of T)","2021 trend adjusted (county yield or 80% of T)","2022 trend adjusted (county yield or 80% of T)","Projected 2023 trend adjusted (county yield or 80% of T)","Projected 2024 trend adjusted (county yield or 80% of T)","Trend adjustments 2023",null,"2024 Bench Mark (2018-22 olympic avg)","2024 Bench Mark Price (2017-21 olympic avg)","2024 Benchmark Revenue","2024 Guarantee Revenue","2024 Maximum Payment Rate","Projected 2024 Actual Yield","Projected 2024 National Price","Projected 2024 Actual Revenue","Projected 2024 Formula Payment Rate","Projected 2024 ARC-CO Payment Rate"]
[null,{"$f":"E5&G5&I5","v":"AlconaCornAll"},"26001","Michigan","Alcona","","Corn","Bushel","All",134.49,126.52,94,145.11000000000001,190.78,152.04,{"$f":"AVERAGE(K5:O5)+R5","v":142.97999999999999},{"$f":"AVERAGE(L5:P5)+R5","v":146.27199999999999},1.29,null,{"$f":"(SUM(K5:O5)-MIN(K5:O5)-MAX(K5:O5))/(COUNT(K5:O5)-2)","v":141.22333333333333},{"$f":"'Background Calculations'!$L$54","v":4.8499999999999996},{"$f":"T5*U5","v":684.93316666666658},{"$f":"V5*0.86","v":589.04252333333329},{"$f":"V5*0.1","v":68.493316666666658},{"$f":"'2024 Farm Bill Calculator'!$E$23","v":165.76666666666665},{"$f":"'2024 Farm Bill Calculator'!$E$37","v":4.5},{"$f":"Z5*Y5","v":745.94999999999993},{"$f":"IF(W5-AA5>0,W5-AA5,0)","v":0},{"$f":"MIN(AB5,X5)","v":0}]
[null,"AlgerCornAll","26001","Michigan","Alger","","Corn","Bushel","All",58.4,111,58.49,183.9,110.84,79.53,108.752,108.30239999999999,null,null,100.45666666666666,{"$f":"'Background Calculations'!$L$54","v":4.8499999999999996},487.21483333333327,419.00475666666659,48.721483333333332,{"$f":"'2024 Farm Bill Calculator'!$E$23","v":165.76666666666665},{"$f":"'2024 Farm Bill Calculator'!$E$37","v":4.5},{"$f":"Z6*Y6","v":745.94999999999993},{"$f":"IF(W6-AA6>0,W6-AA6,0)","v":0},{"$f":"MIN(AB6,X6)","v":0}]
[null,"AlleganCornIrrigated","26001","Michigan","Allegan","","Corn","Bushel","Irrigated",231.01,210.20999999999998,198.41,212.20999999999998,207.15,213.29,209.89399999999998,209.83079999999998,1.64,null,209.85666666666668,{"$f":"'Background Calculations'!$L$54","v":4.8499999999999996},1017.8048333333334,875.31215666666662,101.78048333333334,{"$f":"'2024 Farm Bill Calculator'!$E$23","v":165.76666666666665},{"$f":"'2024 Farm Bill Calculator'!$E$37","v":4.5},745.94999999999993,129.36215666666669,101.78048333333334]
[null,"AlleganCornNonirrigated","26003","Michigan","Allegan","","Corn","Bushel","Nonirrigated",187.24,160.18,159.46,171.39000000000001,182.26,184.47,173.11199999999999,175.69839999999999,1.56,null,171.27666666666664,{"$f":"'Background Calculations'!$L$54","v":4.8499999999999996},830.69183333333319,714.39497666666648,83.069183333333328,{"$f":"'2024 Farm Bill Calculator'!$E$23","v":165.76666666666665},{"$f":"'2024 Farm Bill Calculator'!$E$37","v":4.5},745.94999999999993,0,0]
[null,"AlpenaCornAll","26003","Michigan","Alpena","","Corn","Bushel","All",150.15,116.72999999999999,121.46000000000001,166.04999999999998,188.58,147.57,149.49800000000002,156.05160000000001,1.42,null,145.02666666666667,{"$f":"'Background Calculations'!$L$54","v":4.8499999999999996},703.37933333333331,604.90622666666661,70.337933333333339,{"$f":"'2024 Farm Bill Calculator'!$E$23","v":165.76666666666665},{"$f":"'2024 Farm Bill Calculator'!$E$37","v":4.5},745.94999999999993,0,0]
[null,"AntrimCornAll","26005","Michigan","Antrim","","Corn","Bushel","All",140.73000000000002,115.55,95.44,147.51,142.32,83.53,117.78,118.22599999999998,0.91,null,117.77000000000002,{"$f":"'Background Calculations'!$L$54","v":4.8499999999999996},571.18450000000007,491.21867000000003,57.11845000000001,{"$f":"'2024 Farm Bill Calculator'!$E$23","v":165.76666666666665},{"$f":"'2024 Farm Bill Calculator'!$E$37","v":4.5},745.94999999999993,0,0]
[null,"ArenacCornAll","26005","Michigan","Arenac","","Corn","Bushel","All",175.67999999999998,174.92,142.30000000000001,152.66,192.54,159.07,165.99799999999999,164.21359999999999,1.7,null,162.2166666666667,{"$f":"'Background Calculations'!$L$54","v":4.8499999999999996},786.75083333333339,676.60571666666669,78.675083333333347,{"$f":"'2024 Farm Bill Calculator'!$E$23","v":165.76666666666665},{"$f":"'2024 Farm Bill Calculator'!$E$37","v":4.5},745.94999999999993,0,0]
[null,"BaragaCornAll","26005","Michigan","Baraga","","Corn","Bushel","All",84,111,84,140.19999999999999,110.84,79.53,105.11399999999999,103.93679999999999,null,null,101.94666666666666,{"$f":"'Background Calculations'!$L$54","v":4.8499999999999996},494.44133333333326,425.21954666666659,49.444133333333326,{"$f":"'2024 Farm Bill Calculator'!$E$23","v":165.76666666666665},{"$f":"'2024 Farm Bill Calculator'!$E$37","v":4.5},745.94999999999993,0,0]
[null,"BarryCornIrrigated","26005","Michigan","Barry","","Corn","Bushel","Irrigated",205.67000000000002,192.86999999999998,180.10999999999999,213.11,221.97,209.46,204.79399999999998,207.1788,1.29,null,205.14666666666665,{"$f":"'Background Calculations'!$L$54","v":4.8499999999999996},994.96133333333319,855.66674666666654,99.496133333333319,{"$f":"'2024 Farm Bill Calculator'!$E$23","v":165.76666666666665},{"$f":"'2024 Farm Bill Calculator'!$E$37","v":4.5},745.94999999999993,109.71674666666661,99.496133333333319]
[null,"BarryCornNonirrigated","26005","Michigan","Barry","","Corn","Bushel","Nonirrigated",174.37,150.64000000000001,141.24,164.37,179.36,178,164.00200000000001,166.67439999999999,1.28,null,164.33666666666667,{"$f":"'Background Calculations'!$L$54","v":4.8499999999999996},797.03283333333331,685.44823666666662,79.703283333333331,{"$f":"'2024 Farm Bill Calculator'!$E$23","v":165.76666666666665},{"$f":"'2024 Farm Bill Calculator'!$E$37","v":4.5},745.94999999999993,0,0]
[null,"BayCornIrrigated","26007","Michigan","Bay","","Corn","Bushel","Irrigated",190,205.41000000000003,181.66,195.41000000000003,209.45,186.99,197.64400000000003,196.0908,1.86,null,195.93666666666672,{"$f":"'Background Calculations'!$L$54","v":4.8499999999999996},950.29283333333353,817.2518366666668,95.029283333333353,{"$f":"'2024 Farm Bill Calculator'!$E$23","v":165.76666666666665},{"$f":"'2024 Farm Bill Calculator'!$E$37","v":4.5},745.94999999999993,71.301836666666873,71.301836666666873]
[null,"BayCornNonirrigated","26007","Michigan","Bay","","Corn","Bushel","Nonirrigated",179.37,193.44,165.65,168.13000000000002,203.92999999999998,181.3,184.34,182.52,1.85,null,180.95666666666671,{"$f":"'Background Calculations'!$L$54","v":4.8499999999999996},877.63983333333351,754.7702566666668,87.763983333333357,{"$f":"'2024 Farm Bill Calculator'!$E$23","v":165.76666666666665},{"$f":"'2024 Farm Bill Calculator'!$E$37","v":4.5},745.94999999999993,8.8202566666668645,8.8202566666668645]
[null,"BenzieCornAll","26007","Michigan","Benzie","","Corn","Bushel","All",135.26,117.95,97.23,110.37,157.9,89.86,114.66200000000001,114.0044,null,null,108.51666666666669,{"$f":"'Background Calculations'!$L$54","v":4.8499999999999996},526.30583333333345,452.62301666666679,52.630583333333348,{"$f":"'2024 Farm Bill Calculator'!$E$23","v":165.76666666666665},{"$f":"'2024 Farm Bill Calculator'!$E$37","v":4.5},745.94999999999993,0,0]
[null,"BerrienCornIrrigated","26009","Michigan","Berrien","","Corn","Bushel","Irrigated",242.81,215.38,195.32999999999998,210.48000000000002,219.84,218.06,213.90800000000004,213.61360000000005,2.09,null,214.64000000000007,{"$f":"'Background Calculations'!$L$54","v":4.8499999999999996},1041.0040000000004,895.26344000000029,104.10040000000004,{"$f":"'2024 Farm Bill Calculator'!$E$23","v":165.76666666666665},{"$f":"'2024 Farm Bill Calculator'!$E$37","v":4.5},745.94999999999993,149.31344000000036,104.10040000000004]
[null,"BerrienCornNonirrigated","26009","Michigan","Berrien","","Corn","Bushel","Nonirrigated",183.76999999999998,172.69,152.96,161.75,183.7,177.23,171.636,171.42519999999999,1.97,null,170.55666666666664,{"$f":"'Background Calculations'!$L$54","v":4.8499999999999996},827.19983333333312,711.39185666666651,82.719983333333317,{"$f":"'2024 Farm Bill Calculator'!$E$23","v":165.76666666666665},{"$f":"'2024 Farm Bill Calculator'!$E$37","v":4.5},745.94999999999993,0,0]
[null,"BranchCornIrrigated","26009","Michigan","Branch","","Corn","Bushel","Irrigated",204.46,192.68,198.91,203.94,181.26000000000002,218.86,200.89,202.53199999999998,1.76,null,198.51,{"$f":"'Background Calculations'!$L$54","v":4.8499999999999996},962.7734999999999,827.98520999999994,96.277349999999998,{"$f":"'2024 Farm Bill Calculator'!$E$23","v":165.76666666666665},{"$f":"'2024 Farm Bill Calculator'!$E$37","v":4.5},745.94999999999993,82.035210000000006,82.035210000000006]
{"$rows_left_out":270}
{"sheet":"SCO Coverage","index":5,"n_rows":9,"n_cols":2,"rows_kept":9,"cut":false,"hidden":true,"merged":[]}
[null,0]
[null,"85-86%"]
[null,"80-86%"]
[null,"75-86%"]
[null,"70-86%"]
[null,"65-86%"]
[null,"60-86%"]
[null,"55-86%"]
[null,"50-86%"]

{"sheet":"County List","index":6,"n_rows":81,"n_cols":3,"rows_kept":81,"cut":false,"hidden":true,"merged":[]}
[]
[null,null,"Alcona"]
[null,null,"Alger"]
[null,null,"Allegan"]
[null,null,"Alpena"]
[null,null,"Antrim"]
[null,null,"Arenac"]
[null,null,"Baraga"]
[null,null,"Barry"]
[null,null,"Bay"]
[null,null,"Benzie"]
[null,null,"Berrien"]
[null,null,"Branch"]
[null,null,"Calhoun"]
[null,null,"Cass"]
[null,null,"Charlevoix"]
[null,null,"Cheboygan"]
[null,null,"Chippewa"]
[null,null,"Clare"]
[null,null,"Clinton"]
{"$rows_left_out":61}